Target
Cytochrome P450 2C9
Ligand
BDBM50447555
Substrate
Meas. Tech.
ChEMBL_1289245 (CHEMBL3119697)
IC50
15000±n/a nM
Citation
 Wang, YYang, WFinlay, HJHarikrishnan, LSJiang, JKamau, MGVan Kirk, KNirschl, DSTaylor, DSChen, AYYin, XSleph, PGYang, RZHuang, CSAdam, LPLawrence, RMWexler, RRSalvati, ME Diphenylpyridylethanamine (DPPE)-based aminoheterocycles as cholesteryl ester transfer protein inhibitors. Bioorg Med Chem Lett 24:860-4 (2014)  
Target
Name:
Cytochrome P450 2C9
Synonyms:
(R)-limonene 6-monooxygenase CP2C9_HUMAN CYP2C9 Cytochrome P450 2C9 (CYP2C9 ) P-450MP P450 PB-1 | S-mephenytoin 4-hydroxylase
Type:
Enzyme
Mol. Mass.:
55636.33
Organism:
Homo sapiens (Human)
Description:
P11712
Residue:
490
  
Inhibitor
Name:
BDBM50447555
Synonyms:
CHEMBL3116154
Type:
Small organic molecule
Emp. Form.:
C28H18ClF7N4O
Mol. Mass.:
594.911
SMILES:
FC(F)C(F)(F)Oc1cc(F)cc(c1)[C@@](Cc1ccccc1)(Nc1nc2c(F)cc(F)cc2[nH]1)c1ccc(Cl)cn1
: