Target
Cholesteryl ester transfer protein
Ligand
BDBM50447550
Substrate
Meas. Tech.
ChEMBL_1289411 (CHEMBL3116907)
IC50
20200±n/a nM
Citation
 Wang, YYang, WFinlay, HJHarikrishnan, LSJiang, JKamau, MGVan Kirk, KNirschl, DSTaylor, DSChen, AYYin, XSleph, PGYang, RZHuang, CSAdam, LPLawrence, RMWexler, RRSalvati, ME Diphenylpyridylethanamine (DPPE)-based aminoheterocycles as cholesteryl ester transfer protein inhibitors. Bioorg Med Chem Lett 24:860-4 (2014)  
Target
Name:
Cholesteryl ester transfer protein
Synonyms:
CETP Cholesteryl ester transfer protein (CETP) | Lipid transfer protein I
Type:
Enzyme
Mol. Mass.:
54751.53
Organism:
Homo sapiens (Human)
Description:
P11597
Residue:
493
  
Inhibitor
Name:
BDBM50447550
Synonyms:
CHEMBL3116349
Type:
Small organic molecule
Emp. Form.:
C27H22ClF4N3S
Mol. Mass.:
531.995
SMILES:
Fc1cc(cc(c1)C(Cc1ccccc1)(Nc1nc2CCCCc2s1)c1ccc(Cl)cn1)C(F)(F)F
: