Target
Nicotinamide phosphoribosyltransferase
Ligand
BDBM50447572
Substrate
Meas. Tech.
ChEMBL_1289424 (CHEMBL3116920)
Kd
61000±n/a nM
Citation
 Dragovich, PSZhao, GBaumeister, TBravo, BGiannetti, AMHo, YCHua, RLi, GLiang, XMa, XO'Brien, TOh, ASkelton, NJWang, CWang, WWang, YXiao, YYuen, PWZak, MZhao, QZheng, X Fragment-based design of 3-aminopyridine-derived amides as potent inhibitors of human nicotinamide phosphoribosyltransferase (NAMPT). Bioorg Med Chem Lett 24:954-62 (2014)  
Target
Name:
Nicotinamide phosphoribosyltransferase
Synonyms:
NAMPT NAmPRTase Nicotinamide phosphoribosyltransferase (NAMPT) PBEF1 | Pre-B-cell colony-enhancing factor 1
Type:
Enzyme
Mol. Mass.:
55524.98
Organism:
Homo sapiens (Human)
Description:
P43490
Residue:
491
  
Inhibitor
Name:
BDBM50447572
Synonyms:
CHEMBL3112694
Type:
Small organic molecule
Emp. Form.:
C10H9N3O2
Mol. Mass.:
203.1974
SMILES:
Cc1ocnc1C(=O)Nc1cccnc1
: