Target
Oxa40
Ligand
BDBM98791
Substrate
Meas. Tech.
ChEMBL_1289443 (CHEMBL3117137)
IC50
20000±n/a nM
Citation
 Blizzard, TAChen, HKim, SWu, JBodner, RGude, CImbriglio, JYoung, KPark, YWOgawa, ARaghoobar, SHairston, NPainter, REWisniewski, DScapin, GFitzgerald, PSharma, NLu, JHa, SHermes, JHammond, ML Discovery of MK-7655, aß-lactamase inhibitor for combination with Primaxin®. Bioorg Med Chem Lett 24:780-5 (2014)  
Target
Name:
Oxa40
Synonyms:
Beta-lactamase | Class D β-lactamase (OXA-24)
Type:
Enzyme
Mol. Mass.:
30946.50
Organism:
Acinetobacter baumannii
Description:
Q8RLA6
Residue:
275
  
Inhibitor
Name:
BDBM98791
Synonyms:
US8487093, 178
Type:
Small organic molecule
Emp. Form.:
C12H14N4O6S
Mol. Mass.:
342.328
SMILES:
OS(=O)(=O)ON1[C@H]2CN([C@@H](CC2)C(=O)Nc2cccnc2)C1=O
: