Target
Dipeptidyl peptidase 8
Ligand
BDBM50447696
Substrate
Meas. Tech.
ChEMBL_1289678 (CHEMBL3118376)
IC50
7400±n/a nM
Citation
 Namoto, KSirockin, FOstermann, NGessier, FFlohr, SSedrani, RGerhartz, BTrappe, JHassiepen, UDuttaroy, AFerreira, SSutton, JMClark, DEFenton, GBeswick, MBaeschlin, DK Discovery of C-(1-aryl-cyclohexyl)-methylamines as selective, orally available inhibitors of dipeptidyl peptidase IV. Bioorg Med Chem Lett 24:731-6 (2014)  
Target
Name:
Dipeptidyl peptidase 8
Synonyms:
DPP8 DPRP-1 Dipeptidyl peptidase 8 (DPP-8) Dipeptidyl peptidase 8/9 Dipeptidyl peptidase VIII Prolyl dipeptidase DPP8
Type:
Enzyme
Mol. Mass.:
103342.62
Organism:
Homo sapiens (Human)
Description:
Q6V1X1
Residue:
898
  
Inhibitor
Name:
BDBM50447696
Synonyms:
CHEMBL3112968
Type:
Small organic molecule
Emp. Form.:
C24H26ClF3N4O
Mol. Mass.:
478.938
SMILES:
NC[C@@]1(CC[C@@H](CC1)N1CCc2c(nc(nc2C1=O)C(F)(F)F)C1CC1)c1cccc(Cl)c1
: