Target
Cytochrome P450 2D6
Ligand
BDBM50447694
Substrate
Meas. Tech.
ChEMBL_1289671 (CHEMBL3118369)
IC50
4500±n/a nM
Citation
 Namoto, KSirockin, FOstermann, NGessier, FFlohr, SSedrani, RGerhartz, BTrappe, JHassiepen, UDuttaroy, AFerreira, SSutton, JMClark, DEFenton, GBeswick, MBaeschlin, DK Discovery of C-(1-aryl-cyclohexyl)-methylamines as selective, orally available inhibitors of dipeptidyl peptidase IV. Bioorg Med Chem Lett 24:731-6 (2014)  
Target
Name:
Cytochrome P450 2D6
Synonyms:
CP2D6_HUMAN CYP2DL1 Cytochrome P450 2D6 (CYP2D6) P450-DB1
Type:
Protein
Mol. Mass.:
55774.82
Organism:
Homo sapiens (Human)
Description:
P10635
Residue:
497
  
Inhibitor
Name:
BDBM50447694
Synonyms:
CHEMBL3112967
Type:
Small organic molecule
Emp. Form.:
C19H21ClF3N5O
Mol. Mass.:
427.851
SMILES:
NC[C@@]1(CC[C@@H](CC1)N1CCn2c(nnc2C(F)(F)F)C1=O)c1cccc(Cl)c1
: