Target
Fatty-acid amide hydrolase 1
Ligand
BDBM50447748
Substrate
Meas. Tech.
ChEMBL_1290137 (CHEMBL3117477)
IC50
0.072000±n/a nM
Citation
 Kono, MMatsumoto, TImaeda, TKawamura, TFujimoto, SKosugi, YOdani, TShimizu, YMatsui, HShimojo, MKori, M Design, synthesis, and biological evaluation of a series of piperazine ureas as fatty acid amide hydrolase inhibitors. Bioorg Med Chem 22:1468-78 (2014)  
Target
Name:
Fatty-acid amide hydrolase 1
Synonyms:
Anandamide amidohydrolase FAAH FAAH1_HUMAN Fatty-acid amide hydrolase (FAAH) Oleamide hydrolase 1
Type:
Protein
Mol. Mass.:
63071.19
Organism:
Homo sapiens (Human)
Description:
O00519
Residue:
579
  
Inhibitor
Name:
BDBM50447748
Synonyms:
CHEMBL3113271
Type:
Small organic molecule
Emp. Form.:
C19H17F2N7O
Mol. Mass.:
397.3814
SMILES:
Fc1cccc(c1F)-c1ccnc(n1)N1CCN(CC1)C(=O)Nc1cccnn1
: