Target
Orexin receptor type 2
Ligand
BDBM50447797
Substrate
Meas. Tech.
ChEMBL_1290418 (CHEMBL3119327)
IC50
894±n/a nM
Citation
 Sifferlen, TBoller, AChardonneau, ACottreel, EHoecker, JAissaoui, HWilliams, JTBrotschi, CHeidmann, BSiegrist, RGatfield, JTreiber, ABrisbare-Roch, CJenck, FBoss, C Discovery of substituted lactams as novel dual orexin receptor antagonists. Synthesis, preliminary structure-activity relationship studies and efforts towards improved metabolic stability and pharmacokinetic properties. Part 1. Bioorg Med Chem Lett 24:1201-8 (2014)  
Target
Name:
Orexin receptor type 2
Synonyms:
HCRTR2 OX2R_HUMAN Orexin receptor type 2 (OR-2) Orexin receptor type 2 (OX2R) Ox-2-R | Ox2-R
Type:
Protein
Mol. Mass.:
50710.53
Organism:
Homo sapiens (Human)
Description:
O43614
Residue:
444
  
Inhibitor
Name:
BDBM50447797
Synonyms:
CHEMBL3113759 | US9242970, 216
Type:
Small organic molecule
Emp. Form.:
C22H24F3NO4
Mol. Mass.:
423.4255
SMILES:
COc1cccc(OC)c1C1CCC(C)C(=O)N1Cc1ccc(OC(F)(F)F)cc1
: