Target
Orexin/Hypocretin receptor type 1
Ligand
BDBM50447792
Substrate
Meas. Tech.
ChEMBL_1290419 (CHEMBL3119328)
IC50
121±n/a nM
Citation
 Sifferlen, TBoller, AChardonneau, ACottreel, EHoecker, JAissaoui, HWilliams, JTBrotschi, CHeidmann, BSiegrist, RGatfield, JTreiber, ABrisbare-Roch, CJenck, FBoss, C Discovery of substituted lactams as novel dual orexin receptor antagonists. Synthesis, preliminary structure-activity relationship studies and efforts towards improved metabolic stability and pharmacokinetic properties. Part 1. Bioorg Med Chem Lett 24:1201-8 (2014)  
Target
Name:
Orexin/Hypocretin receptor type 1
Synonyms:
HCRTR1 OX1R_HUMAN Orexin receptor type 1 (OR 1) Orexin receptor type 1 (OX1) Orexin receptor type 1 (OxR1) | Ox1r
Type:
Protein
Mol. Mass.:
47554.50
Organism:
Homo sapiens (Human)
Description:
O43613
Residue:
425
  
Inhibitor
Name:
BDBM50447792
Synonyms:
CHEMBL3113764
Type:
Small organic molecule
Emp. Form.:
C21H22F3NO4
Mol. Mass.:
409.3989
SMILES:
COc1cccc(OC)c1[C@@H]1C[C@H](C)C(=O)N1Cc1ccc(OC(F)(F)F)cc1
: