Target
Probable ubiquitin carboxyl-terminal hydrolase FAF-X
Ligand
BDBM50437695
Substrate
Meas. Tech.
ChEMBL_1290831 (CHEMBL3118416)
IC50
5900±n/a nM
Citation
 Peng, ZMaxwell, DSSun, DBhanu Prasad, BASchuber, PTPal, AYing, YHan, DGao, LWang, SLevitzki, AKapuria, VTalpaz, MYoung, MShowalter, HDDonato, NJBornmann, WG Degrasyn-like symmetrical compounds: possible therapeutic agents for multiple myeloma (MM-I). Bioorg Med Chem 22:1450-8 (2014)  
Target
Name:
Probable ubiquitin carboxyl-terminal hydrolase FAF-X
Synonyms:
DFFRX FAM Fat facets protein-related, X-linked USP9X Ubiquitin thioesterase FAF-X Ubiquitin-specific-processing protease FAF-X | hFAM
Type:
PROTEIN
Mol. Mass.:
292239.69
Organism:
Homo sapiens (Human)
Description:
ChEMBL_107634
Residue:
2570
  
Inhibitor
Name:
BDBM50437695
Synonyms:
CHEMBL1923233
Type:
Small organic molecule
Emp. Form.:
C19H18BrN3O
Mol. Mass.:
384.27
SMILES:
CCC[C@H](NC(=O)C(=C\c1cccc(Br)n1)\C#N)c1ccccc1
: