Target
Coagulation factor XII
Ligand
BDBM50447851
Substrate
Meas. Tech.
ChEMBL_1291598 (CHEMBL3118954)
Ki
>15000±n/a nM
Citation
 Blizzard, TASingh, SPatil, BChidurala, NKomanduri, VDebnath, SBelyakov, SCrespo, AStruck, AKurtz, MWiltsie, JShen, XSonatore, LArocho, MLewis, DOgletree, MBiftu, T Heterocyclic core analogs of a direct thrombin inhibitor. Bioorg Med Chem Lett 24:1111-5 (2014)  
Target
Name:
Coagulation factor XII
Synonyms:
Beta-factor XIIa part 1 Carboxylesterase 2 (intestine, liver) Coagulation factor XII (FXII) Coagulation factor XIIa light chain FA12_HUMAN Factor XIIa (fXIIa) Hageman factor
Type:
Enzyme
Mol. Mass.:
67810.07
Organism:
Homo sapiens (Human)
Description:
P00748
Residue:
615
  
Inhibitor
Name:
BDBM50447851
Synonyms:
CHEMBL3114560
Type:
Small organic molecule
Emp. Form.:
C19H28ClN3O3
Mol. Mass.:
381.897
SMILES:
CC(C)(C)[C@@H](O)C(=O)N1CCC[C@H]1C(=O)NCc1cc(Cl)ccc1CN
: