Target
Tyrosine-protein kinase JAK3
Ligand
BDBM50355501
Substrate
Meas. Tech.
ChEMBL_1288559 (CHEMBL3118992)
IC50
15±n/a nM
Citation
 McDonnell, MEBian, HWrobel, JSmith, GRLiang, SMa, HReitz, AB Anilino-monoindolylmaleimides as potent and selective JAK3 inhibitors. Bioorg Med Chem Lett 24:1116-21 (2014)  
Target
Name:
Tyrosine-protein kinase JAK3
Synonyms:
JAK-3 JAK3_HUMAN Janus kinase 3 (JAK3) L-JAK | Leukocyte janus kinase
Type:
Protein
Mol. Mass.:
125111.08
Organism:
Homo sapiens (Human)
Description:
P52333
Residue:
1124
  
Inhibitor
Name:
BDBM50355501
Synonyms:
INCB-018424 RUXOLITINIB PHOSPHATE US10766894, Compound TABLE 1.1 US11203595, TABLE 1.1 | US11279703, TABLE 6.147
Type:
Small organic molecule
Emp. Form.:
C17H18N6
Mol. Mass.:
306.365
SMILES:
N#CC[C@H](C1CCCC1)n1cc(cn1)-c1ncnc2[nH]ccc12
: