Target
Alpha-ketoglutarate-dependent dioxygenase alkB homolog 3
Ligand
BDBM50447939
Substrate
Meas. Tech.
ChEMBL_1288598 (CHEMBL3119218)
IC50
2000±n/a nM
Citation
 Nakao, SMabuchi, MShimizu, TItoh, YTakeuchi, YUeda, MMizuno, HShigi, NOhshio, IJinguji, KUeda, YYamamoto, MFurukawa, TAoki, STsujikawa, KTanaka, A Design and synthesis of prostate cancer antigen-1 (PCA-1/ALKBH3) inhibitors as anti-prostate cancer drugs. Bioorg Med Chem Lett 24:1071-4 (2014)  
Target
Name:
Alpha-ketoglutarate-dependent dioxygenase alkB homolog 3
Synonyms:
ABH3 ALKBH3 DEPC-1 Prostate cancer antigen 1
Type:
PROTEIN
Mol. Mass.:
33382.86
Organism:
Homo sapiens (Human)
Description:
ChEMBL_108024
Residue:
286
  
Inhibitor
Name:
BDBM50447939
Synonyms:
CHEMBL3114990
Type:
Small organic molecule
Emp. Form.:
C22H15ClN4O
Mol. Mass.:
386.834
SMILES:
Clc1ccc2nc([nH]c2c1)-n1[nH]c(c(-c2ccccc2)c1=O)-c1ccccc1
: