Target
Dihydrofolate reductase
Ligand
BDBM50448066
Substrate
Meas. Tech.
ChEMBL_1289501 (CHEMBL3117417)
IC50
500±n/a nM
Citation
 El-Subbagh, HIHassan, GSEl-Messery, SMAl-Rashood, STAl-Omary, FAAbulfadl, YSShabayek, MI Nonclassical antifolates, part 5. Benzodiazepine analogs as a new class of DHFR inhibitors: synthesis, antitumor testing and molecular modeling study. Eur J Med Chem 74:234-45 (2014)  
Target
Name:
Dihydrofolate reductase
Synonyms:
DHFR Dihydrofolate reductase | Dihydrofolate reductase (DHFR)
Type:
Enzyme
Mol. Mass.:
21603.71
Organism:
Bos taurus (Cattle)
Description:
P00376
Residue:
187
  
Inhibitor
Name:
BDBM50448066
Synonyms:
CHEMBL3115731
Type:
Small organic molecule
Emp. Form.:
C28H32N2O6
Mol. Mass.:
492.5635
SMILES:
COc1cc(\C=C2/CCCc3c2nc(C)nc3-c2cc(OC)c(OC)c(OC)c2)cc(OC)c1OC
: