Target
Phosphatidylinositol 4-kinase alpha
Ligand
BDBM50448097
Substrate
Meas. Tech.
ChEMBL_1292924 (CHEMBL3122829)
IC50
5.0±n/a nM
Citation
 Leivers, ALTallant, MShotwell, JBDickerson, SLeivers, MRMcDonald, OBGobel, JCreech, KLStrum, SLMathis, ARogers, SMoore, CBBotyanszki, J Discovery of selective small molecule type III phosphatidylinositol 4-kinase alpha (PI4KIIIa) inhibitors as anti hepatitis C (HCV) agents. J Med Chem 57:2091-106 (2014)  
Target
Name:
Phosphatidylinositol 4-kinase alpha
Synonyms:
PI4-kinase alpha PI4K-alpha PI4KA/PI4KAP2 PIK4 PIK4CA Phosphatidylinositol 4-kinase alpha (PI4KA) | PtdIns-4-kinase alpha
Type:
Protein
Mol. Mass.:
231326.70
Organism:
Homo sapiens (Human)
Description:
P42356
Residue:
2102
  
Inhibitor
Name:
BDBM50448097
Synonyms:
CHEMBL3121333
Type:
Small organic molecule
Emp. Form.:
C26H19F2N5O3S
Mol. Mass.:
519.523
SMILES:
COc1ncc(cc1NS(=O)(=O)c1ccc(F)cc1F)-c1ccc2nc(N)c(nc2c1)-c1ccccc1
: