Target
Metabotropic glutamate receptor 5
Ligand
BDBM50448158
Substrate
Meas. Tech.
ChEMBL_1292286 (CHEMBL3124717)
Ki
6.5±n/a nM
Citation
 Zhang, LBalan, GBarreiro, GBoscoe, BPChenard, LKCianfrogna, JClaffey, MMChen, LCoffman, KJDrozda, SEDunetz, JRFonseca, KRGalatsis, PGrimwood, SLazzaro, JTMancuso, JYMiller, ELReese, MRRogers, BNSakurada, ISkaddan, MSmith, DLStepan, AFTrapa, PTuttle, JBVerhoest, PRWalker, DPWright, ASZaleska, MMZasadny, KShaffer, CL Discovery and preclinical characterization of 1-methyl-3-(4-methylpyridin-3-yl)-6-(pyridin-2-ylmethoxy)-1H-pyrazolo-[3,4-b]pyrazine (PF470): a highly potent, selective, and efficacious metabotropic glutamate receptor 5 (mGluR5) negative allosteric modulator. J Med Chem 57:861-77 (2014)  
Target
Name:
Metabotropic glutamate receptor 5
Synonyms:
GPRC1E GRM5_HUMAN metabotropic glutamate 5 | metabotropic glutamate 5a
Type:
Enzyme
Mol. Mass.:
132484.72
Organism:
Homo sapiens (Human)
Description:
Residue:
1212
  
Inhibitor
Name:
BDBM50448158
Synonyms:
CHEMBL3122214
Type:
Small organic molecule
Emp. Form.:
C18H14F2N6O2
Mol. Mass.:
384.3396
SMILES:
Cn1nc(-c2ncccc2OC(F)F)c2ncc(OCc3ccccn3)nc12
: