Target
Glucocorticoid receptor
Ligand
BDBM50448172
Substrate
Meas. Tech.
ChEMBL_1292840 (CHEMBL3122504)
Ki
>100±n/a nM
Citation
 Carson, MWLuz, JGSuen, CMontrose, CZink, RRuan, XCheng, CCole, HAdrian, MDKohlman, DTMabry, TSnyder, NCondon, BMaletic, MClawson, DPustilnik, ACoghlan, MJ Glucocorticoid receptor modulators informed by crystallography lead to a new rationale for receptor selectivity, function, and implications for structure-based design. J Med Chem 57:849-60 (2014)  
Target
Name:
Glucocorticoid receptor
Synonyms:
GCR_HUMAN GRL Glucocorticoid receptor (GRFP) Nuclear receptor subfamily 3 group C member 1
Type:
Enzyme
Mol. Mass.:
85656.87
Organism:
Homo sapiens (Human)
Description:
P04150
Residue:
777
  
Inhibitor
Name:
BDBM50448172
Synonyms:
CHEMBL3120322
Type:
Small organic molecule
Emp. Form.:
C23H21NO2S
Mol. Mass.:
375.483
SMILES:
[#6]S(=O)(=O)[#7]-c1ccccc1\[#6]=[#6]-1/c2ccccc2-[#6]-[#6]-c2ccccc-12
: