Target
Cytochrome P450 2C9
Ligand
BDBM50448294
Substrate
Meas. Tech.
ChEMBL_1293772 (CHEMBL3123344)
IC50
>30000±n/a nM
Citation
 Hudkins, RLJosef, KABecknell, NCAimone, LDLyons, JAMathiasen, JRGruner, JARaddatz, R Discovery of (1R,6S)-5-[4-(1-cyclobutyl-piperidin-4-yloxy)-phenyl]-3,4-diaza-bicyclo[4.1.0]hept-4-en-2-one (R,S-4a): histamine H(3) receptor inverse agonist demonstrating potent cognitive enhancing and wake promoting activity. Bioorg Med Chem Lett 24:1303-6 (2014)  
Target
Name:
Cytochrome P450 2C9
Synonyms:
(R)-limonene 6-monooxygenase CP2C9_HUMAN CYP2C9 Cytochrome P450 2C9 (CYP2C9 ) P-450MP P450 PB-1 | S-mephenytoin 4-hydroxylase
Type:
Enzyme
Mol. Mass.:
55636.33
Organism:
Homo sapiens (Human)
Description:
P11712
Residue:
490
  
Inhibitor
Name:
BDBM50448294
Synonyms:
CHEMBL3121096
Type:
Small organic molecule
Emp. Form.:
C20H25N3O2
Mol. Mass.:
339.4314
SMILES:
O=C1NN=C([C@@H]2C[C@H]12)c1ccc(OC2CCN(CC2)C2CCC2)cc1
: