Target
Muscarinic acetylcholine receptor M2
Ligand
BDBM50448369
Substrate
Meas. Tech.
ChEMBL_1292392 (CHEMBL3123985)
EC50
69±n/a nM
Citation
 Matera, CFlammini, LQuadri, MVivo, VBallabeni, VHolzgrabe, UMohr, KDe Amici, MBarocelli, EBertoni, SDallanoce, C Bis(ammonio)alkane-type agonists of muscarinic acetylcholine receptors: synthesis, in vitro functional characterization, and in vivo evaluation of their analgesic activity. Eur J Med Chem 75:222-32 (2014)  
Target
Name:
Muscarinic acetylcholine receptor M2
Synonyms:
ACM2_PIG Cholinergic, muscarinic LOC100715343 Muscarinic receptor 2
Type:
Enzyme Catalytic Domain
Mol. Mass.:
51688.65
Organism:
GUINEA PIG
Description:
Cholinergic, muscarinic 0 GUINEA PIG::P06199
Residue:
466
  
Inhibitor
Name:
BDBM50448369
Synonyms:
CHEMBL3121476
Type:
Small organic molecule
Emp. Form.:
C30H46N4O4
Mol. Mass.:
526.7095
SMILES:
C[N+](C)(CCCCCCCC[N+](C)(C)CC#CCOC1=NOCC1)CCCN1C(=O)c2ccccc2C1=O
: