Target
Glucokinase regulatory protein
Ligand
BDBM50448559
Substrate
Meas. Tech.
ChEMBL_1296099 (CHEMBL3131528)
IC50
12±n/a nM
Citation
 Ashton, KSAndrews, KLBryan, MCBryan, MCChen, JChen, KChen, MChmait, SCroghan, MCupples, RFotsch, CHelmering, JJordan, SRKurzeja, RJMichelsen, KPennington, LDPoon, SFSivits, GVan, GVonderfecht, SLWahl, RCZhang, JLloyd, DJHale, CSt Jean, DJ Small molecule disruptors of the glucokinase-glucokinase regulatory protein interaction: 1. Discovery of a novel tool compound for in vivo proof-of-concept. J Med Chem 57:309-24 (2014)  
Target
Name:
Glucokinase regulatory protein
Synonyms:
GCKR GKRP | Glucokinase regulator
Type:
PROTEIN
Mol. Mass.:
68685.97
Organism:
Homo sapiens (Human)
Description:
ChEMBL_103091
Residue:
625
  
Inhibitor
Name:
BDBM50448559
Synonyms:
CHEMBL3127352
Type:
Small organic molecule
Emp. Form.:
C23H30F3N3O4S2
Mol. Mass.:
533.627
SMILES:
C[C@H]1COCCN1C[C@H]1CN(CCN1c1ccc(cc1)[C@](C)(O)C(F)(F)F)S(=O)(=O)c1cccs1
: