Target
Coagulation factor XI
Ligand
BDBM50448601
Substrate
Meas. Tech.
ChEMBL_1296332 (CHEMBL3129742)
Ki
15±n/a nM
Citation
 Quan, MLWong, PCWang, CWoerner, FSmallheer, JMBarbera, FABozarth, JMBrown, RLHarpel, MRLuettgen, JMMorin, PEPeterson, TRamamurthy, VRendina, ARRossi, KAWatson, CAWei, AZhang, GSeiffert, DWexler, RR Tetrahydroquinoline derivatives as potent and selective factor XIa inhibitors. J Med Chem 57:955-69 (2014)  
Target
Name:
Coagulation factor XI
Synonyms:
Coagulation factor XIa Coagulation factor XIa light chain FA11_HUMAN Factor XIa PTA | Plasma thromboplastin antecedent
Type:
Enzyme
Mol. Mass.:
70130.58
Organism:
Homo sapiens (Human)
Description:
P03951
Residue:
625
  
Inhibitor
Name:
BDBM50448601
Synonyms:
CHEMBL3127474
Type:
Small organic molecule
Emp. Form.:
C32H31N5O3
Mol. Mass.:
533.6202
SMILES:
CNC(=O)Nc1ccc(-c2cccc(c2)[C@@H]2C[C@](C)(c3ccccc3)c3cc(ccc3N2)C(N)=N)c(c1)C(O)=O
: