Target
Nicotinamide phosphoribosyltransferase
Ligand
BDBM50448625
Substrate
Meas. Tech.
ChEMBL_1296519 (CHEMBL3130658)
IC50
2.0±n/a nM
Citation
 Giannetti, AMZheng, XSkelton, NJWang, WBravo, BJBair, KWBaumeister, TCheng, ECrocker, LFeng, YGunzner-Toste, JHo, YCHua, RLiederer, BMLiu, YMa, XO'Brien, TOeh, JSampath, DShen, YWang, CWang, LWu, HXiao, YYuen, PWZak, MZhao, GZhao, QDragovich, PS Fragment-based identification of amides derived from trans-2-(pyridin-3-yl)cyclopropanecarboxylic acid as potent inhibitors of human nicotinamide phosphoribosyltransferase (NAMPT). J Med Chem 57:770-92 (2014)  
Target
Name:
Nicotinamide phosphoribosyltransferase
Synonyms:
NAMPT NAmPRTase Nicotinamide phosphoribosyltransferase (NAMPT) PBEF1 | Pre-B-cell colony-enhancing factor 1
Type:
Enzyme
Mol. Mass.:
55524.98
Organism:
Homo sapiens (Human)
Description:
P43490
Residue:
491
  
Inhibitor
Name:
BDBM50448625
Synonyms:
CHEMBL3127508
Type:
Small organic molecule
Emp. Form.:
C22H24N4O4S
Mol. Mass.:
440.515
SMILES:
CC(C)(O)Cn1cc(cn1)S(=O)(=O)c1ccc(NC(=O)[C@@H]2C[C@H]2c2cccnc2)cc1
: