Target
Nicotinamide phosphoribosyltransferase
Ligand
BDBM50435350
Substrate
Meas. Tech.
ChEMBL_1296519 (CHEMBL3130658)
IC50
2.0±n/a nM
Citation
 Giannetti, AMZheng, XSkelton, NJWang, WBravo, BJBair, KWBaumeister, TCheng, ECrocker, LFeng, YGunzner-Toste, JHo, YCHua, RLiederer, BMLiu, YMa, XO'Brien, TOeh, JSampath, DShen, YWang, CWang, LWu, HXiao, YYuen, PWZak, MZhao, GZhao, QDragovich, PS Fragment-based identification of amides derived from trans-2-(pyridin-3-yl)cyclopropanecarboxylic acid as potent inhibitors of human nicotinamide phosphoribosyltransferase (NAMPT). J Med Chem 57:770-92 (2014)  
Target
Name:
Nicotinamide phosphoribosyltransferase
Synonyms:
NAMPT NAmPRTase Nicotinamide phosphoribosyltransferase (NAMPT) PBEF1 | Pre-B-cell colony-enhancing factor 1
Type:
Enzyme
Mol. Mass.:
55524.98
Organism:
Homo sapiens (Human)
Description:
P43490
Residue:
491
  
Inhibitor
Name:
BDBM50435350
Synonyms:
CHEMBL17289
Type:
Small organic molecule
Emp. Form.:
C19H22ClN5O
Mol. Mass.:
371.864
SMILES:
Clc1ccc(OCCCCCCNC(Nc2ccncc2)=NC#N)cc1
: