Target
Nicotinamide phosphoribosyltransferase
Ligand
BDBM50448640
Substrate
Meas. Tech.
ChEMBL_1296518 (CHEMBL3130657)
Kd
17000±n/a nM
Citation
 Giannetti, AMZheng, XSkelton, NJWang, WBravo, BJBair, KWBaumeister, TCheng, ECrocker, LFeng, YGunzner-Toste, JHo, YCHua, RLiederer, BMLiu, YMa, XO'Brien, TOeh, JSampath, DShen, YWang, CWang, LWu, HXiao, YYuen, PWZak, MZhao, GZhao, QDragovich, PS Fragment-based identification of amides derived from trans-2-(pyridin-3-yl)cyclopropanecarboxylic acid as potent inhibitors of human nicotinamide phosphoribosyltransferase (NAMPT). J Med Chem 57:770-92 (2014)  
Target
Name:
Nicotinamide phosphoribosyltransferase
Synonyms:
NAMPT NAmPRTase Nicotinamide phosphoribosyltransferase (NAMPT) PBEF1 | Pre-B-cell colony-enhancing factor 1
Type:
Enzyme
Mol. Mass.:
55524.98
Organism:
Homo sapiens (Human)
Description:
P43490
Residue:
491
  
Inhibitor
Name:
BDBM50448640
Synonyms:
CHEMBL3127519
Type:
Small organic molecule
Emp. Form.:
C15H14N2O
Mol. Mass.:
238.2845
SMILES:
O=C(Nc1ccncc1)[C@@H]1C[C@H]1c1ccccc1
: