Target
Nicotinamide phosphoribosyltransferase
Ligand
BDBM50448647
Substrate
Meas. Tech.
ChEMBL_1296518 (CHEMBL3130657)
Kd
78000±n/a nM
Citation
 Giannetti, AMZheng, XSkelton, NJWang, WBravo, BJBair, KWBaumeister, TCheng, ECrocker, LFeng, YGunzner-Toste, JHo, YCHua, RLiederer, BMLiu, YMa, XO'Brien, TOeh, JSampath, DShen, YWang, CWang, LWu, HXiao, YYuen, PWZak, MZhao, GZhao, QDragovich, PS Fragment-based identification of amides derived from trans-2-(pyridin-3-yl)cyclopropanecarboxylic acid as potent inhibitors of human nicotinamide phosphoribosyltransferase (NAMPT). J Med Chem 57:770-92 (2014)  
Target
Name:
Nicotinamide phosphoribosyltransferase
Synonyms:
NAMPT NAmPRTase Nicotinamide phosphoribosyltransferase (NAMPT) PBEF1 | Pre-B-cell colony-enhancing factor 1
Type:
Enzyme
Mol. Mass.:
55524.98
Organism:
Homo sapiens (Human)
Description:
P43490
Residue:
491
  
Inhibitor
Name:
BDBM50448647
Synonyms:
CHEMBL3127516
Type:
Small organic molecule
Emp. Form.:
C12H14N2O2
Mol. Mass.:
218.2518
SMILES:
CC(=O)Nc1ccc(NC(=O)C2CC2)cc1
: