Target
DNA polymerase lambda
Ligand
BDBM50448688
Substrate
Meas. Tech.
ChEMBL_1297300 (CHEMBL3132086)
IC50
>200000±n/a nM
Citation
 Mizushina, YSuzuki-Fukudome, HTakeuchi, TTakemoto, KKuriyama, IYoshida, HKamisuki, SSugawara, F Formosusin A, a novel specific inhibitor of mammalian DNA polymeraseß from the fungus Paecilomyces formosus. Bioorg Med Chem 22:1070-6 (2014)  
Target
Name:
DNA polymerase lambda
Synonyms:
4.2.99.- Pol Lambda Poll
Type:
PROTEIN
Mol. Mass.:
62954.48
Organism:
Mus musculus
Description:
ChEMBL_108049
Residue:
573
  
Inhibitor
Name:
BDBM50448688
Synonyms:
Pecilocin | Variotin
Type:
Small organic molecule
Emp. Form.:
C17H25NO3
Mol. Mass.:
291.3853
SMILES:
CCCC[C@@H](O)\C=C(/C)\C=C\C=C\C(=O)N1CCCC1=O
: