Target
Deoxyribonuclease-1
Ligand
BDBM50448688
Substrate
Meas. Tech.
ChEMBL_1297301 (CHEMBL3132087)
IC50
>200000±n/a nM
Citation
 Mizushina, YSuzuki-Fukudome, HTakeuchi, TTakemoto, KKuriyama, IYoshida, HKamisuki, SSugawara, F Formosusin A, a novel specific inhibitor of mammalian DNA polymeraseß from the fungus Paecilomyces formosus. Bioorg Med Chem 22:1070-6 (2014)  
Target
Name:
Deoxyribonuclease-1
Synonyms:
DNAS1_BOVIN DNL1
Type:
PROTEIN
Mol. Mass.:
31341.11
Organism:
Bos taurus
Description:
ChEMBL_1297301
Residue:
282
  
Inhibitor
Name:
BDBM50448688
Synonyms:
Pecilocin | Variotin
Type:
Small organic molecule
Emp. Form.:
C17H25NO3
Mol. Mass.:
291.3853
SMILES:
CCCC[C@@H](O)\C=C(/C)\C=C\C=C\C(=O)N1CCCC1=O
: