Target
T7 RNA polymerase
Ligand
BDBM50448688
Substrate
Meas. Tech.
ChEMBL_1297304 (CHEMBL3132090)
IC50
>200000±n/a nM
Citation
 Mizushina, YSuzuki-Fukudome, HTakeuchi, TTakemoto, KKuriyama, IYoshida, HKamisuki, SSugawara, F Formosusin A, a novel specific inhibitor of mammalian DNA polymeraseß from the fungus Paecilomyces formosus. Bioorg Med Chem 22:1070-6 (2014)  
Target
Name:
T7 RNA polymerase
Synonyms:
DNA-directed RNA polymerase | RPOL_BPT7
Type:
PROTEIN
Mol. Mass.:
98862.21
Organism:
Enterobacteria phage T7
Description:
ChEMBL_1297304
Residue:
883
  
Inhibitor
Name:
BDBM50448688
Synonyms:
Pecilocin | Variotin
Type:
Small organic molecule
Emp. Form.:
C17H25NO3
Mol. Mass.:
291.3853
SMILES:
CCCC[C@@H](O)\C=C(/C)\C=C\C=C\C(=O)N1CCCC1=O
: