Target
DNA-directed DNA polymerase
Ligand
BDBM50448690
Substrate
Meas. Tech.
ChEMBL_1297307 (CHEMBL3132272)
IC50
>200000±n/a nM
Citation
 Mizushina, YSuzuki-Fukudome, HTakeuchi, TTakemoto, KKuriyama, IYoshida, HKamisuki, SSugawara, F Formosusin A, a novel specific inhibitor of mammalian DNA polymeraseß from the fungus Paecilomyces formosus. Bioorg Med Chem 22:1070-6 (2014)  
Target
Name:
DNA-directed DNA polymerase
Synonyms:
43 DPOL_BPT4
Type:
PROTEIN
Mol. Mass.:
103605.06
Organism:
Enterobacteria phage T4
Description:
ChEMBL_1297307
Residue:
898
  
Inhibitor
Name:
BDBM50448690
Synonyms:
CHEMBL3127728
Type:
Small organic molecule
Emp. Form.:
C17H25NO3
Mol. Mass.:
291.3853
SMILES:
CCCCC(=O)C=C(C)C=CCCC(=O)N1CCCC1=O
: