Target
Bifunctional epoxide hydrolase 2
Ligand
BDBM50448696
Substrate
Meas. Tech.
ChEMBL_1297583 (CHEMBL3130369)
IC50
12000±n/a nM
Citation
 Goldberg, FWDossetter, AGScott, JSRobb, GRBoyd, SGroombridge, SDKemmitt, PDSjögren, TGutierrez, PMdeSchoolmeester, JSwales, JGTurnbull, AVWild, MJ Optimization of brain penetrant 11ß-hydroxysteroid dehydrogenase type I inhibitors and in vivo testing in diet-induced obese mice. J Med Chem 57:970-86 (2014)  
Target
Name:
Bifunctional epoxide hydrolase 2
Synonyms:
Cytosolic epoxide hydrolase 2 EPHX2 HYES_HUMAN Soluble epoxide hydrolase (sEH) | epoxide hydrolase 2, cytoplasmic
Type:
Enzyme
Mol. Mass.:
62613.07
Organism:
Homo sapiens (Human)
Description:
P34913
Residue:
555
  
Inhibitor
Name:
BDBM50448696
Synonyms:
CHEMBL3127869
Type:
Small organic molecule
Emp. Form.:
C22H27N3O3S
Mol. Mass.:
413.533
SMILES:
O[C@@]12CC3CC(C1)[C@H](NC(=O)c1sc(OCC4(CC4)C#N)nc1C1CC1)C(C3)C2
: