Target
11-beta-hydroxysteroid dehydrogenase 1
Ligand
BDBM50448705
Substrate
Meas. Tech.
ChEMBL_1297892 (CHEMBL3132105)
IC50
9.9±n/a nM
Citation
 Goldberg, FWDossetter, AGScott, JSRobb, GRBoyd, SGroombridge, SDKemmitt, PDSjögren, TGutierrez, PMdeSchoolmeester, JSwales, JGTurnbull, AVWild, MJ Optimization of brain penetrant 11ß-hydroxysteroid dehydrogenase type I inhibitors and in vivo testing in diet-induced obese mice. J Med Chem 57:970-86 (2014)  
Target
Name:
11-beta-hydroxysteroid dehydrogenase 1
Synonyms:
11-DH 11-beta-Hydroxysteroid Dehydrogenase 1 (11-beta-HSD1) 11beta-HSD1A Corticosteroid 11-beta-dehydrogenase isozyme 1 (11-beta-HSD-1) Hsd11 | Hsd11b1
Type:
Enzyme
Mol. Mass.:
32369.70
Organism:
Mus musculus (mouse)
Description:
P50172
Residue:
292
  
Inhibitor
Name:
BDBM50448705
Synonyms:
CHEMBL3127855
Type:
Small organic molecule
Emp. Form.:
C21H30N2O5S
Mol. Mass.:
422.538
SMILES:
COCCOc1nc([C@H]2CCCO2)c(s1)C(=O)NC1C2CC3CC1CC(O)(C3)C2
: