Target
Aldehyde dehydrogenase, dimeric NADP-preferring
Ligand
BDBM50448802
Substrate
Meas. Tech.
ChEMBL_1295316 (CHEMBL3130564)
IC50
18000±n/a nM
Citation
 Kimble-Hill, ACParajuli, BChen, CHMochly-Rosen, DHurley, TD Development of selective inhibitors for aldehyde dehydrogenases based on substituted indole-2,3-diones. J Med Chem 57:714-22 (2014)  
Target
Name:
Aldehyde dehydrogenase, dimeric NADP-preferring
Synonyms:
AL3A1_HUMAN ALDH3A1 Aldehyde dehydrogenase family 3 member A1 (ALDH3A1) | Aldehyde dehydrogenase family 3 member A1 (ALDH3A1) (Q122A)
Type:
Protein
Mol. Mass.:
50394.38
Organism:
Homo sapiens (Human)
Description:
Residue:
453
  
Inhibitor
Name:
BDBM50448802
Synonyms:
CHEMBL3128207
Type:
Small organic molecule
Emp. Form.:
C16H12BrNO2
Mol. Mass.:
330.176
SMILES:
Brc1ccc2N(CCc3ccccc3)C(=O)C(=O)c2c1
: