Target
Nitric oxide synthase, brain
Ligand
BDBM50448835
Substrate
Meas. Tech.
ChEMBL_1295339 (CHEMBL3130587)
Ki
5.0±n/a nM
Citation
 Huang, HLi, HYang, SChreifi, GMartásek, PRoman, LJMeyskens, FLPoulos, TLSilverman, RB Potent and selective double-headed thiophene-2-carboximidamide inhibitors of neuronal nitric oxide synthase for the treatment of melanoma. J Med Chem 57:686-700 (2014)  
Target
Name:
Nitric oxide synthase, brain
Synonyms:
Bnos NC-NOS NOS type I nNOS Neuronal nitric oxide synthase Nitric Oxide Synthase, brain Nitric oxide synthase, brain (nNOS) Nitric-oxide synthase, brain (nNOS) Nos1 | Peptidyl-cysteine S-nitrosylase NOS1
Type:
Enzyme
Mol. Mass.:
160570.98
Organism:
Rattus norvegicus (rat)
Description:
Recombinant nNOS overexpressed in E. coli was used in enzyme assays.
Residue:
1429
  
Inhibitor
Name:
BDBM50448835
Synonyms:
CHEMBL3128246
Type:
Small organic molecule
Emp. Form.:
C25H25N5S2
Mol. Mass.:
459.63
SMILES:
NC(=Nc1ccc(CCNCc2cccc(c2)N=C(N)c2cccs2)cc1)c1cccs1
: