Target
Leucyl-cystinyl aminopeptidase
Ligand
BDBM50449011
Substrate
Meas. Tech.
ChEMBL_1297665 (CHEMBL3130959)
Ki
1800±n/a nM
Citation
 Mountford, SJAlbiston, ALCharman, WNNg, LHolien, JKParker, MWNicolazzo, JAThompson, PEChai, SY Synthesis, structure-activity relationships and brain uptake of a novel series of benzopyran inhibitors of insulin-regulated aminopeptidase. J Med Chem 57:1368-77 (2014)  
Target
Name:
Leucyl-cystinyl aminopeptidase
Synonyms:
Aminopeptidase Cystinyl aminopeptidase Insulin-regulated membrane aminopeptidase LCAP_HUMAN Leucyl-cystinyl aminopeptidase, pregnancy serum form Oxytocinase Placental leucine aminopeptidase
Type:
PROTEIN
Mol. Mass.:
117334.10
Organism:
Homo sapiens (Human)
Description:
ChEMBL_1473494
Residue:
1025
  
Inhibitor
Name:
BDBM50449011
Synonyms:
CHEMBL1604159
Type:
Small organic molecule
Emp. Form.:
C17H16N2O4
Mol. Mass.:
312.3199
SMILES:
CCOC(=O)C1C(c2cccnc2)c2ccc(O)cc2OC1=N
: