Target
Tyrosyl-DNA phosphodiesterase 1
Ligand
BDBM50449161
Substrate
Meas. Tech.
ChEMBL_1297454 (CHEMBL3129814)
IC50
>111000±n/a nM
Citation
 Beck, DEAgama, KMarchand, CChergui, APommier, YCushman, M Synthesis and biological evaluation of new carbohydrate-substituted indenoisoquinoline topoisomerase I inhibitors and improved syntheses of the experimental anticancer agents indotecan (LMP400) and indimitecan (LMP776). J Med Chem 57:1495-512 (2014)  
Target
Name:
Tyrosyl-DNA phosphodiesterase 1
Synonyms:
TDP1 Tyrosyl-DNA phosphodiesterase 1 | Tyrosyl-DNA phosphodiesterase 1 (TDP1)
Type:
Enzyme
Mol. Mass.:
68430.66
Organism:
Homo sapiens (Human)
Description:
Q9NUW8
Residue:
608
  
Inhibitor
Name:
BDBM50449161
Synonyms:
CHEMBL3127437
Type:
Small organic molecule
Emp. Form.:
C22H19NO8
Mol. Mass.:
425.3882
SMILES:
COc1cc2c3C(=O)c4cc5OCOc5cc4-c3n(C[C@@H](O)CO)c(=O)c2cc1OC
: