Target
Cholinesterase
Ligand
BDBM50449210
Substrate
Meas. Tech.
ChEMBL_1298067 (CHEMBL3129498)
IC50
830±n/a nM
Citation
 Bautista-Aguilera, OMEsteban, GBolea, INikolic, KAgbaba, DMoraleda, IIriepa, ISamadi, ASoriano, EUnzeta, MMarco-Contelles, J Design, synthesis, pharmacological evaluation, QSAR analysis, molecular modeling and ADMET of novel donepezil-indolyl hybrids as multipotent cholinesterase/monoamine oxidase inhibitors for the potential treatment of Alzheimer's disease. Eur J Med Chem 75:82-95 (2014)  
Target
Name:
Cholinesterase
Synonyms:
BCHE CHLE_HORSE | Cholinesterase
Type:
Enzyme
Mol. Mass.:
65643.35
Organism:
Equus caballus (Horse)
Description:
P81908
Residue:
574
  
Inhibitor
Name:
BDBM50449210
Synonyms:
CHEMBL3127967
Type:
Small organic molecule
Emp. Form.:
C28H35N3O
Mol. Mass.:
429.597
SMILES:
Cn1c(CNCC#C)cc2cc(OCCCC3CCN(Cc4ccccc4)CC3)ccc12
: