Target
Acetylcholinesterase
Ligand
BDBM50449214
Substrate
Meas. Tech.
ChEMBL_1298301 (CHEMBL3130754)
IC50
140±n/a nM
Citation
 Bautista-Aguilera, OMEsteban, GBolea, INikolic, KAgbaba, DMoraleda, IIriepa, ISamadi, ASoriano, EUnzeta, MMarco-Contelles, J Design, synthesis, pharmacological evaluation, QSAR analysis, molecular modeling and ADMET of novel donepezil-indolyl hybrids as multipotent cholinesterase/monoamine oxidase inhibitors for the potential treatment of Alzheimer's disease. Eur J Med Chem 75:82-95 (2014)  
Target
Name:
Acetylcholinesterase
Synonyms:
ACES_ELEEL Acetylcholinesterase (EeAChE) | ache
Type:
Enzyme
Mol. Mass.:
71812.79
Organism:
Electrophorus electricus (Electric eel)
Description:
Residue:
633
  
Inhibitor
Name:
BDBM50449214
Synonyms:
CHEMBL3127977
Type:
Small organic molecule
Emp. Form.:
C32H39N3O
Mol. Mass.:
481.6716
SMILES:
Cn1c(CNCc2ccccc2)cc2cc(OCCCC3CCN(Cc4ccccc4)CC3)ccc12
: