Target
Acetylcholinesterase
Ligand
BDBM50449219
Substrate
Meas. Tech.
ChEMBL_1298301 (CHEMBL3130754)
IC50
15200±n/a nM
Citation
 Bautista-Aguilera, OMEsteban, GBolea, INikolic, KAgbaba, DMoraleda, IIriepa, ISamadi, ASoriano, EUnzeta, MMarco-Contelles, J Design, synthesis, pharmacological evaluation, QSAR analysis, molecular modeling and ADMET of novel donepezil-indolyl hybrids as multipotent cholinesterase/monoamine oxidase inhibitors for the potential treatment of Alzheimer's disease. Eur J Med Chem 75:82-95 (2014)  
Target
Name:
Acetylcholinesterase
Synonyms:
ACES_ELEEL Acetylcholinesterase (EeAChE) | ache
Type:
Enzyme
Mol. Mass.:
71812.79
Organism:
Electrophorus electricus (Electric eel)
Description:
Residue:
633
  
Inhibitor
Name:
BDBM50449219
Synonyms:
CHEMBL3124971
Type:
Small organic molecule
Emp. Form.:
C18H20N2O
Mol. Mass.:
280.3642
SMILES:
COc1ccc2n(C)c(CNCc3ccccc3)cc2c1
: