Target
Sodium/glucose cotransporter 2
Ligand
BDBM50449252
Substrate
Meas. Tech.
ChEMBL_1295137 (CHEMBL3128638)
IC50
150±n/a nM
Citation
 Putapatri, SRKanwal, ABanerjee, SKKantevari, S Synthesis of novel l-rhamnose derived acyclic C-nucleosides with substituted 1,2,3-triazole core as potent sodium-glucose co-transporter (SGLT) inhibitors. Bioorg Med Chem Lett 24:1528-31 (2014)  
Target
Name:
Sodium/glucose cotransporter 2
Synonyms:
Na(+)/glucose cotransporter 2 SGLT2 Sodium-Dependent Glucose Cotransporter 2 (SGLT2) Solute carrier family 5 member 2
Type:
Protein
Mol. Mass.:
72902.00
Organism:
Homo sapiens (Human)
Description:
P31639
Residue:
672
  
Inhibitor
Name:
BDBM50449252
Synonyms:
CHEMBL3125142
Type:
Small organic molecule
Emp. Form.:
C16H18F3N3O6
Mol. Mass.:
405.3258
SMILES:
CCOC(=O)c1nnn(c1[C@H](O)[C@@H](O)[C@H](C)O)-c1ccc(OC(F)(F)F)cc1
: