Target
Phosphatidylinositol 4,5-bisphosphate 3-kinase catalytic subunit beta isoform
Ligand
BDBM50449291
Substrate
Meas. Tech.
ChEMBL_1295722 (CHEMBL3129534)
IC50
20±n/a nM
Citation
 Certal, VHalley, FVirone-Oddos, AFiloche-Rommé, BCarry, JCGruss-Leleu, FBertin, LGuizani, HPilorge, FRichepin, PKarlsson, ACharrier, VAbecassis, PYVincent, LNicolas, JPLengauer, CGarcia-Echeverria, CSchio, L Preparation and optimization of new 4-(2-(indolin-1-yl)-2-oxoethyl)-2-morpholinothiazole-5-carboxylic acid and amide derivatives as potent and selective PI3Kß inhibitors. Bioorg Med Chem Lett 24:1506-10 (2014)  
Target
Name:
Phosphatidylinositol 4,5-bisphosphate 3-kinase catalytic subunit beta isoform
Synonyms:
PI3-kinase p110 subunit beta PI3Kbeta PIK3CB Phosphatidylinositol 4,5-bisphosphate 3-kinase catalytic subunit beta (PI3Kbeta) Phosphatidylinositol 4,5-bisphosphate 3-kinase catalytic subunit beta isoform (PI3K) Phosphatidylinositol 4,5-bisphosphate 3-kinase catalytic subunit beta isoform (PI3Kbeta) Phosphatidylinositol-4,5-bisphosphate 3-kinase catalytic subunit beta isoform Phosphoinositide 3-Kinase (PI3K), beta Chain A PtdIns-3-kinase p110
Type:
Enzyme Subunit
Mol. Mass.:
122769.00
Organism:
Homo sapiens (Human)
Description:
P42338
Residue:
1070
  
Inhibitor
Name:
BDBM50449291
Synonyms:
CHEMBL3125375
Type:
Small organic molecule
Emp. Form.:
C19H21FN4O3S
Mol. Mass.:
404.458
SMILES:
CC1Cc2cc(F)ccc2N1C(=O)Cc1nc(sc1C(N)=O)N1CCOCC1
: