Target
Neuronal acetylcholine receptor subunit alpha-4/beta-2
Ligand
BDBM50066788
Substrate
Meas. Tech.
ChEMBL_143855 (CHEMBL748859)
Ki
0.048000±n/a nM
Citation
 Holladay, MWBai, HLi, YLin, NHDaanen, JFRyther, KBWasicak, JTKincaid, JFHe, YHettinger, AMHuang, PAnderson, DJBannon, AWBuckley, MJCampbell, JEDonnelly-Roberts, DLGunther, KLKim, DJKuntzweiler, TASullivan, JPDecker, MWArneric, SP Structure-activity studies related to ABT-594, a potent nonopioid analgesic agent: effect of pyridine and azetidine ring substitutions on nicotinic acetylcholine receptor binding affinity and analgesic activity in mice. Bioorg Med Chem Lett 8:2797-802 (1999)  
Target
Name:
Neuronal acetylcholine receptor subunit alpha-4/beta-2
Synonyms:
Neuronal acetylcholine receptor alpha4/beta2 Neuronal acetylcholine receptor; alpha4/beta2
Type:
Mol. Mass.:
Description:
Components:
This complex has 0 components.
Component 1
Name:
Neuronal acetylcholine receptor subunit alpha-4
Synonyms:
ACHA4_RAT Cholinergic, Nicotinic Alpha4Beta2 Chrna4 Neuronal acetylcholine receptor (alpha4beta2 nAChR) Neuronal acetylcholine receptor subunit alpha 4 beta 2 | Neuronal acetylcholine receptor subunit alpha-4
Type:
Enzyme
Mol. Mass.:
70196.44
Organism:
Rattus norvegicus (Rat)
Description:
P09483
Residue:
630
  
Component 2
Name:
Neuronal acetylcholine receptor subunit beta-2
Synonyms:
ACHB2_RAT Chrnb2 Neuronal acetylcholine receptor non-alpha-1 chain
Type:
Enzyme
Mol. Mass.:
56910.32
Organism:
Rattus norvegicus (Rat)
Description:
P12390
Residue:
500
  
Inhibitor
Name:
BDBM50066788
Synonyms:
(S)-3-(azetidin-2-ylmethoxy)-2-fluoropyridine CHEMBL308538
Type:
Small organic molecule
Emp. Form.:
C9H11FN2O
Mol. Mass.:
182.1948
SMILES:
Fc1ncccc1OC[C@@H]1CCN1
: