Target
Glutamate receptor ionotropic, NMDA 1/2B
Ligand
BDBM50451775
Substrate
Meas. Tech.
ChEMBL_141291 (CHEMBL747358)
Ki
31±n/a nM
Citation
 Curtis, NRDiggle, HJKulagowski, JJLondon, CGrimwood, SHutson, PHMurray, FRichards, PMacaulay, AWafford, KA Novel N1-(benzyl)cinnamamidine derived NR2B subtype-selective NMDA receptor antagonists. Bioorg Med Chem Lett 13:693-6 (2003)  
Target
Name:
Glutamate receptor ionotropic, NMDA 1/2B
Synonyms:
GluN1/GluN2B NMDA receptor Glutamate [NMDA] receptor subunit epsilon 2/zeta 1 nr2b nam
Type:
Enzyme
Mol. Mass.:
Description:
Components:
This complex has 2 components.
Component 1
Name:
Glutamate receptor ionotropic, NMDA 1
Synonyms:
GRIN1 Glutamate [NMDA] receptor subunit zeta-1 N-methyl-D-aspartate receptor subunit NR1 NMDZ1_HUMAN | phencyclidine
Type:
Enzyme Catalytic Domain
Mol. Mass.:
105397.81
Organism:
Homo sapiens (Human)
Description:
Q05586
Residue:
938
  
Component 2
Name:
Glutamate receptor ionotropic, NMDA 2B
Synonyms:
GRIN2B Glutamate [NMDA] receptor subunit epsilon 2 N-methyl D-aspartate receptor subtype 2B NMDAR2B NR3 | hNR3
Type:
PROTEIN
Mol. Mass.:
166375.46
Organism:
Homo sapiens (Human)
Description:
ChEMBL_1438829
Residue:
1484
  
Inhibitor
Name:
BDBM50451775
Synonyms:
CHEMBL158510
Type:
Small organic molecule
Emp. Form.:
C17H15F3N2
Mol. Mass.:
304.3096
SMILES:
FC(F)(F)c1cccc(CNC(=N)\C=C\c2ccccc2)c1
: