Target
Neuronal acetylcholine receptor subunit alpha-4/beta-2
Ligand
BDBM50452053
Substrate
Meas. Tech.
ChEMBL_143728 (CHEMBL756124)
Ki
16±n/a nM
Citation
 Wei, ZLXiao, YKellar, KJKozikowski, AP Synthesis and pharmacological characterization of bivalent ligands of epibatidine at neuronal nicotinic acetylcholine receptors. Bioorg Med Chem Lett 14:1855-8 (2004)  
Target
Name:
Neuronal acetylcholine receptor subunit alpha-4/beta-2
Synonyms:
Neuronal acetylcholine receptor alpha4/beta2 Neuronal acetylcholine receptor; alpha4/beta2
Type:
Mol. Mass.:
Description:
Components:
This complex has 0 components.
Component 1
Name:
Neuronal acetylcholine receptor subunit alpha-4
Synonyms:
ACHA4_RAT Cholinergic, Nicotinic Alpha4Beta2 Chrna4 Neuronal acetylcholine receptor (alpha4beta2 nAChR) Neuronal acetylcholine receptor subunit alpha 4 beta 2 | Neuronal acetylcholine receptor subunit alpha-4
Type:
Enzyme
Mol. Mass.:
70196.44
Organism:
Rattus norvegicus (Rat)
Description:
P09483
Residue:
630
  
Component 2
Name:
Neuronal acetylcholine receptor subunit beta-2
Synonyms:
ACHB2_RAT Chrnb2 Neuronal acetylcholine receptor non-alpha-1 chain
Type:
Enzyme
Mol. Mass.:
56910.32
Organism:
Rattus norvegicus (Rat)
Description:
P12390
Residue:
500
  
Inhibitor
Name:
BDBM50452053
Synonyms:
CHEMBL55732
Type:
Small organic molecule
Emp. Form.:
C25H30Cl2N4
Mol. Mass.:
457.439
SMILES:
Clc1ccc(cn1)C1CC2CCC1N2CCCN1C2CCC1C(C2)c1ccc(Cl)nc1
: