Target
Coagulation factor X
Ligand
BDBM13679
Substrate
Meas. Tech.
ChEBML_48815
Ki
970±n/a nM
Citation
 Nazaré, MMatter, HKlingler, OAl-Obeidi, FSchreuder, HZoller, GCzech, JLorenz, MDudda, APeyman, ANestler, HPUrmann, MBauer, ALaux, VWehner, VWill, DW Novel factor Xa inhibitors based on a benzoic acid scaffold and incorporating a neutral P1 ligand. Bioorg Med Chem Lett 14:2801-5 (2004)  
Target
Name:
Coagulation factor X
Synonyms:
Activated coagulation factor X (FXa) Coagulation factor X precursor F10 Factor X heavy chain Factor Xa Stuart-Prower factor
Type:
Enzyme
Mol. Mass.:
54726.60
Organism:
Homo sapiens (Human)
Description:
Residue:
488
  
Inhibitor
Name:
BDBM13679
Synonyms:
3-Oxybenzamide 65 | 3-[2-(2,4-dichlorophenyl)ethoxy]-4-methoxy-N-{[1-(pyridin-4-ylmethyl)piperidin-4-yl]methyl}benzamide
Type:
Small organic molecule
Emp. Form.:
C28H31Cl2N3O3
Mol. Mass.:
528.47
SMILES:
COc1ccc(cc1OCCc1ccc(Cl)cc1Cl)C(=O)NCC1CCN(Cc2ccncc2)CC1
: