Target
Beta-2 adrenergic receptor
Ligand
BDBM50421727
Substrate
Meas. Tech.
ChEBML_37819
Kd
1030±n/a nM
Citation
 IJzerman, APBultsma, TTimmerman, H Quantitative evaluation of the beta 2-adrenoceptor intrinsic activity of N-tert-butylphenylethanolamines. J Med Chem 29:549-54 (1986)  
Target
Name:
Beta-2 adrenergic receptor
Synonyms:
ADRB2 Beta-2 adrenergic receptor Beta-2 adrenoreceptor | adrenergic Beta
Type:
Enzyme Catalytic Domain
Mol. Mass.:
47141.18
Organism:
BOVINE
Description:
adrenergic Beta ADRB2 BOVINE::Q28044
Residue:
418
  
Inhibitor
Name:
BDBM50421727
Synonyms:
CHEMBL349845
Type:
Small organic molecule
Emp. Form.:
C13H20N2O3
Mol. Mass.:
252.3095
SMILES:
CC(C)(C)NCC(O)c1ccc(O)c(c1)C(N)=O
: