Target
Beta-2 adrenergic receptor
Ligand
BDBM27958
Substrate
Meas. Tech.
ChEBML_37819
Kd
37±n/a nM
Citation
 IJzerman, APBultsma, TTimmerman, H Quantitative evaluation of the beta 2-adrenoceptor intrinsic activity of N-tert-butylphenylethanolamines. J Med Chem 29:549-54 (1986)  
Target
Name:
Beta-2 adrenergic receptor
Synonyms:
ADRB2 Beta-2 adrenergic receptor Beta-2 adrenoreceptor | adrenergic Beta
Type:
Enzyme Catalytic Domain
Mol. Mass.:
47141.18
Organism:
BOVINE
Description:
adrenergic Beta ADRB2 BOVINE::Q28044
Residue:
418
  
Inhibitor
Name:
BDBM27958
Synonyms:
1-(4-amino-3,5-dichlorophenyl)-2-(tert-butylamino)ethan-1-ol Planipart
Type:
Small organic molecule
Emp. Form.:
C12H18Cl2N2O
Mol. Mass.:
277.19
SMILES:
CC(C)(C)NCC(O)c1cc(Cl)c(N)c(Cl)c1
: