Target
Glycogen phosphorylase, muscle form
Ligand
BDBM50057755
Substrate
Meas. Tech.
ChEMBL_70989 (CHEMBL680567)
Ki
371535±n/a nM
Citation
 Pastor, MCruciani, GWatson, KA A strategy for the incorporation of water molecules present in a ligand binding site into a three-dimensional quantitative structure--activity relationship analysis. J Med Chem 40:4089-102 (1998)  
Target
Name:
Glycogen phosphorylase, muscle form
Synonyms:
Glycogen phosphorylase, muscle form Myophosphorylase PYGM_HUMAN
Type:
PROTEIN
Mol. Mass.:
97097.45
Organism:
Homo sapiens (Human)
Description:
ChEMBL_1449751
Residue:
842
  
Inhibitor
Name:
BDBM50057755
Synonyms:
2-Amino-N-(3,4,5-trihydroxy-6-hydroxymethyl-tetrahydro-pyran-2-yl)-acetamide | CHEMBL539161
Type:
Small organic molecule
Emp. Form.:
C8H16N2O6
Mol. Mass.:
236.2224
SMILES:
NCC(=O)NC1OC(CO)C(O)C(O)C1O
: