Target
Glycogen phosphorylase, muscle form
Ligand
BDBM50422220
Substrate
Meas. Tech.
ChEMBL_70989 (CHEMBL680567)
Ki
38905±n/a nM
Citation
 Pastor, MCruciani, GWatson, KA A strategy for the incorporation of water molecules present in a ligand binding site into a three-dimensional quantitative structure--activity relationship analysis. J Med Chem 40:4089-102 (1998)  
Target
Name:
Glycogen phosphorylase, muscle form
Synonyms:
Glycogen phosphorylase, muscle form Myophosphorylase PYGM_HUMAN
Type:
PROTEIN
Mol. Mass.:
97097.45
Organism:
Homo sapiens (Human)
Description:
ChEMBL_1449751
Residue:
842
  
Inhibitor
Name:
BDBM50422220
Synonyms:
CHEMBL334587
Type:
Small organic molecule
Emp. Form.:
C9H17NO6
Mol. Mass.:
235.2344
SMILES:
CCC(=O)N[C@@H]1O[C@H](CO)[C@@H](O)[C@H](O)[C@H]1O
: