Target
Gag-Pol polyprotein [489-587]
Ligand
BDBM50000562
Substrate
Meas. Tech.
ChEMBL_158036 (CHEMBL768260)
Ki
14125±n/a nM
Citation
 Doweyko, AM Three-dimensional pharmacophores from binding data. J Med Chem 37:1769-78 (1994)  
Target
Name:
Gag-Pol polyprotein [489-587]
Synonyms:
Human immunodeficiency virus type 1 protease Pol polyprotein | gag-pol
Type:
Enzyme Subunit
Mol. Mass.:
10781.16
Organism:
Human immunodeficiency virus type 1
Description:
P04585[489-587]
Residue:
99
  
Inhibitor
Name:
BDBM50000562
Synonyms:
CHEMBL433483
Type:
Small organic molecule
Emp. Form.:
C38H60N10O10
Mol. Mass.:
816.944
SMILES:
CC(C)[C@H](NC(=O)[C@@H](NC(=O)[C@H]1CCCN1C[C@H](Cc1ccccc1)NC(=O)[C@H](CC(N)=O)NC(=O)[C@H](CCC(N)=O)NC(=O)[C@H](CO)NC(C)=O)C(C)C)C(N)=O
: