Target
DNA gyrase subunit A/B
Ligand
BDBM21690
Substrate
Meas. Tech.
ChEMBL_306092 (CHEMBL830867)
IC50
9350±n/a nM
Citation
 Fecik, RADevasthale, PPillai, SKeschavarz-Shokri, AShen, LMitscher, LA Chiral DNA gyrase inhibitors. 3. Probing the chiral preference of the active site of DNA gyrase. Synthesis of 10-fluoro-6-methyl-6,7-dihydro-9-piperazinyl- 2H-benzo[a]quinolizin-20-one-3-carboxylic acid analogues. J Med Chem 48:1229-36 (2005)  
Target
Name:
DNA gyrase subunit A/B
Synonyms:
DNA Gyrase | DNA gyrase A/B
Type:
A2B2 tetramer
Mol. Mass.:
Description:
Components:
This complex has 2 components.
Component 1
Name:
DNA gyrase subunit A
Synonyms:
DNA gyrase GYRA_ECOLI hisW parD
Type:
Enzyme Subunit
Mol. Mass.:
96935.15
Organism:
Escherichia coli (strain K12)
Description:
Residue:
875
  
Component 2
Name:
DNA gyrase subunit B
Synonyms:
DNA gyrase subunit B GYRB_ECOLI acrB gyrB hisU parA | pcbA
Type:
Enzyme Subunit
Mol. Mass.:
89941.28
Organism:
Escherichia coli (strain K12)
Description:
P0AES6
Residue:
804
  
Inhibitor
Name:
BDBM21690
Synonyms:
1-cyclopropyl-6-fluoro-4-oxo-7-(piperazin-1-yl)-1,4-dihydroquinoline-3-carboxylic acid Bay 09867 Ciprinol Ciprofloxacin US9138393, Ciprofloxacin HCl | US9144538, Ciprofloxacin HCl
Type:
Small organic molecule
Emp. Form.:
C17H18FN3O3
Mol. Mass.:
331.3415
SMILES:
OC(=O)c1cn(C2CC2)c2cc(N3CCNCC3)c(F)cc2c1=O
: